{"text_format":"1","workbook":"xlsx","n_sheets":19,"sheets":["Start","main","vd","vd_24h_FOCUS","sed","cum-eff","check_single_applic","drift_only","drift_red_no","drift_red_50","drift_red_75","drift_red_90","drift_cum-effect","drift_data","vd_data","applic_data","report_table_data","revision_table","list_names"],"not_rendered":{"charts":0,"images":4,"macros":1,"external_links":0,"defined_names":533,"comments":0,"pivot_tables":0},"unopened":[],"bounds":{"document_bytes":16777216,"sheet_cells":100000,"rows_first":2000,"rows_last":500,"rows_between":2000,"halvings":0,"cell_chars":16384,"cell_head_chars":4096},"cells_cut":0,"cells_raw":0,"read":"whole","date_system":"1900"}

{"sheet":"Start","index":0,"n_rows":54,"n_cols":2,"rows_kept":54,"cut":false,"hidden":false,"merged":[]}
[]
[]
[]
[]
[]
[]
[]
[]
[]
[]
{"$rows_left_out":45}
{"sheet":"main","index":1,"n_rows":67,"n_cols":12,"rows_kept":67,"cut":false,"hidden":false,"merged":[[31,2,31,6],[26,2,26,6],[27,2,27,6],[28,2,28,6],[29,2,29,6],[30,2,30,6]]}
[]
[]
[null,"intended use parameters"]
[null,"active substance/product","examplamine",null,null,null,null,"rate unit","g/ha",{"$f":"IF(OR(applic_rate_unit=\"L/ha\",applic_rate_unit=\"mL/m²\"),\"d (L/kg)\",\"\")","v":""},1]
[null,"intended use","00-001"]
[]
[null,"# applications",3,null,"%-ile selection","fixed"]
[]
[null,"application rate",100]
[null,"drift scenario","arable crops"]
{"$rows_left_out":58}
{"sheet":"vd","index":2,"n_rows":53,"n_cols":7,"rows_kept":53,"cut":false,"hidden":false,"merged":[]}
[]
[]
[null,"physico-chemical data"]
[null,"vapour pressure meas. (Pa)"]
[null,"   at temperature (°C or K)",null,{"$f":"IF(vapour_pressure_temp=\"\",\"\",\nIF(vapour_pressure_temp<=100,\"°C\",\"K\"))","v":""}]
[null,"vapour pressure, 20 °C (Pa)",{"$f":"IF(vapour_pressure_temp=\"\",\nvapour_pressure_meas,\nROUND(EXP(-((95000/8.3143)*((1/293.15)-(1/(vapour_pressure_temp+273.15*(vapour_pressure_temp<=100)))))+LN(vapour_pressure_meas)),15))","v":0},null,{"$f":"\"substance is \"&HLOOKUP(vapour_pressure_20,volatility_class_def,2)","v":"substance is nonvolatile"}]
[null,"water solubility meas. (mg/L)"]
[null,"   at temperature (°C or K)",null,{"$f":"IF(water_solubility_temp=\"\",\"\",\nIF(water_solubility_temp<=100,\"°C\",\"K\"))","v":""}]
[null,"water solubility, 20 °C (mg/L)",{"$f":"IF(water_solubility_meas=\"\",\n\"\",\nIF(water_solubility_temp=\"\",\nwater_solubility_meas,\nROUND(EXP(-((27000/8.3143)*((1/293.15)-(1/(water_solubility_temp+273.15*(water_solubility_temp<=100)))))+LN(water_solubility_meas)),15)))","v":""},null,{"$f":"IF(MID(compartment,23,3)=\"sed\",water_solubility_20*((300*perc_in_sed)/(10*sed_layer*sed_density)*(1+f_accu_plat)),\"\")","v":""},{"$f":"IF(MID(compartment,23,3)=\"sed\",\"mg/kg (expressed as sed. concentration)\",\"\")","v":""}]
[]
{"$rows_left_out":44}
{"sheet":"vd_24h_FOCUS","index":3,"n_rows":33,"n_cols":9,"rows_kept":33,"cut":false,"hidden":true,"merged":[]}
[]
[]
[null,{"$f":"IF(vd!crit_drift_scenario=\"greenhouse (no drift)\",\"temp. resolution of v/d not supported\",\"\")","v":""},null,null,"rate unit",{"$f":"applic_rate_unit","v":"g/ha"}]
[null,{"$f":"IF(vd!crit_drift_scenario=\"greenhouse (no drift)\",\"by data for the greenhouse scenario\",\"\")","v":""}]
[null,null,null,null,"dep. unit","mg/m²",null,"factor",{"$f":"VLOOKUP(applic_rate_unit,matrix_rate_PEC_terr_,\nMATCH(dep_unit,OFFSET(matrix_rate_PEC_terr_,,,1),FALSE),FALSE)","v":0.1}]
[]
[null,null,null,"dist. (m)",{"$f":"VLOOKUP(vd!crit_drift_scenario,vd_percent_01m,3,FALSE)","v":1},{"$f":"VLOOKUP(vd!crit_drift_scenario,vd_percent_05m,3,FALSE)","v":5},{"$f":"VLOOKUP(vd!crit_drift_scenario,vd_percent_10m,3,FALSE)","v":10},{"$f":"VLOOKUP(vd!crit_drift_scenario,vd_percent_15m,3,FALSE)","v":15},{"$f":"VLOOKUP(vd!crit_drift_scenario,vd_percent_20m,3,FALSE)","v":20}]
[null,"time (h)",{"$f":"\"v/d per h\"&CHAR(10)&IF(VLOOKUP(vd!crit_drift_scenario,vd_percent_01m,4,FALSE)-1,\"high crop\",\"arable crop\")","v":"v/d per h\narable crop"},"v/d in 24 h\nno dissip.",{"$f":"TRANSPOSE(INDIRECT(\"vd!vd_percent_\"&LEFT(vd!vd_rate_select,4))\n*IF(LEFT(vd!vd_rate_select,4)=\"meas\",vd!cf_interc_study,1))","v":0},0,0,0,0]
[null,{"$f":"TRANSPOSE(OFFSET(vd_data!vd_dynamics_time,0,0,1,24))&\" - \"&TRANSPOSE(OFFSET(vd_data!vd_dynamics_time,0,1,1,24))","v":"0 - 1"},{"$f":"TRANSPOSE(OFFSET(\nIF(VLOOKUP(vd!crit_drift_scenario,vd_percent_01m,4,FALSE)-1,vd_data!vd_dynamics_high,vd_data!vd_dynamics_arable),\n0,1,1,24))","v":9.0909090909090912E-2},null,{"$f":"applic_rate_vd*(C9:C32)*(E8:I8)*rate_dep_factor","v":0},0,0,0,0]
[null,"1 - 2",9.0909090909090912E-2,null,0,0,0,0,0]
{"$rows_left_out":24}
{"sheet":"sed","index":4,"n_rows":9,"n_cols":7,"rows_kept":9,"cut":false,"hidden":false,"merged":[]}
[]
[]
[null,"sediment exposure parameters"]
[null,"% in sediment (end of study)",1]
[null,"K(f)oc",5000,null,"sed. layer",{"$f":"IF(K_f_oc<500,2,1)","v":1},"cm"]
[]
[null,"PECsed related to","wet weight",null,"sed. density",{"$f":"IF(LEFT(sed_wet_dry,3)=\"wet\",1.3,2.5)","v":1.3},"g/cm³"]
[]
[null,"DegT50 wat.-sed. system (d)",{"$f":"IF(AND(LEFT(compartment,4)=\"aqua\",MID(compartment,23,3)=\"sed\"),dt50_value,\"\")","v":""},null,"f-accu-plat.",{"$f":"IF(select_accu=\"f-accu-plat.\",\nIF(ISNUMBER(dt50_sed_value),\nIF(dt50_sed_value<110,0,EXP(-LN(2)/dt50_sed_value*365)/(1-EXP(-LN(2)/dt50_sed_value*365))),\n0),\n0)","v":0}]

{"sheet":"cum-eff","index":5,"n_rows":16,"n_cols":10,"rows_kept":16,"cut":false,"hidden":false,"merged":[]}
[]
[]
[null,"dose-response information"]
[null,null,"effect level","dose level","probit",{"$f":"IF(LEN(probit_slope_user)+LEN(probit_intercept_user),\nIF(LEN(probit_slope_user)*LEN(probit_intercept_user),\"user\",\"calc./user\"),\n\"calculated\")","v":"calculated"},"user value","logit",{"$f":"IF(LEN(logit_slope_user)+LEN(logit_intercept_user),\nIF(LEN(logit_slope_user)*LEN(logit_intercept_user),\"user\",\"calc./user\"),\n\"calculated\")","v":"calculated"},"user value"]
[null,"lower dose and effect",0.25,10,"slope",{"$f":"IF(LEN(probit_slope_user),\nprobit_slope_user,\nIF(LEN(effect_lower)*LEN(dose_lower)*LEN(effect_higher)*LEN(dose_higher),\n(NORMINV(effect_lower,0,1)-NORMINV(effect_higher,0,1))/(LN(dose_lower)-LN(dose_higher)),\n\"\"))","v":0.73610888633185234},null,"slope",{"$f":"IF(LEN(logit_slope_user),\nlogit_slope_user,\nIF(LEN(effect_lower)*LEN(dose_lower)*LEN(effect_higher)*LEN(dose_higher),\n(LN(effect_lower/effect_higher)-LN((1-effect_lower)/(1-effect_higher)))/(LN(dose_lower)-LN(dose_higher)),\n\"\"))","v":1.1989778467157903}]
[null,"higher dose and effect",0.5,25,"intercept",{"$f":"IF(LEN(probit_intercept_user),\nprobit_intercept_user,\nIF(LEN(effect_lower)*LEN(dose_lower)*LEN(effect_higher)*LEN(dose_higher),\nNORMINV(effect_higher,0,1)-probit_slope*LN(dose_higher),\n\"\"))","v":-2.3694430986842536},null,"intercept",{"$f":"IF(LEN(logit_intercept_user),\nlogit_intercept_user,\nIF(LEN(effect_lower)*LEN(dose_lower)*LEN(effect_higher)*LEN(dose_higher),\nLN(effect_higher/(1-effect_higher))-logit_slope*LN(dose_higher),\n\"\"))","v":-3.8593608053459887}]
[]
[null,"dose-response fitting","probit"]
[]
[]
{"$rows_left_out":7}
{"sheet":"check_single_applic","index":6,"n_rows":15,"n_cols":14,"rows_kept":15,"cut":false,"hidden":true,"merged":[]}
[]
[]
[null,"drift reduction",0]
[]
[null,"single application\ndrift rate 1 m / 3 m (90. perc.)",{"$f":"IF(no_applic>=(COLUMN()-2),\nINDEX(act_applic_rate,COLUMN()-2)\n*VLOOKUP(INDEX(act_factor,COLUMN()-2),drift_percent_01m,1+2,0)\n*(1-drift_reduction),\n\"\")","v":2.77},2.77,2.77,"","","","","","","","",""]
[]
[null,"v/d rate 1 m / 3 m",{"$f":"IF(no_applic>=(COLUMN()-2),vd_rate_final_01m,\"\")","v":0},0,0,"","","","","","","","",""]
[]
[null,"actual rate 1 m / 3 m",{"$f":"IF(no_applic>=(COLUMN()-2),\nIF(ISNUMBER(drift_rate_01m),drift_rate_01m,0)\n+IF(ISNUMBER(vd_rate_01m),vd_rate_01m,0),\n\"\")","v":2.77},2.77,2.77,"","","","","","","","",""]
[]
{"$rows_left_out":6}
{"sheet":"drift_only","index":7,"n_rows":81,"n_cols":14,"rows_kept":81,"cut":false,"hidden":true,"merged":[]}
[]
[]
[null,"drift reduction",0]
[]
[null,"drift rate 1 m / 3 m",{"$f":"IF(no_applic_copy>=(COLUMN()-2),\nINDEX(act_applic_rate,COLUMN()-2)\n*VLOOKUP(INDEX(act_factor,COLUMN()-2),drift_percent_01m,IF(select_perc_type=\"MAF-crit\",13,no_applic_copy)+2,0)\n*(1-drift_reduction),\n\"\")","v":2.0099999999999998},2.0099999999999998,2.0099999999999998,"","","","","","","","",""]
[null,"drift rate 5 m",{"$f":"IF(no_applic_copy>=(COLUMN()-2),\nINDEX(act_applic_rate,COLUMN()-2)\n*VLOOKUP(INDEX(act_factor,COLUMN()-2),drift_percent_05m,IF(select_perc_type=\"MAF-crit\",13,no_applic_copy)+2,0)\n*(1-drift_reduction),\n\"\")","v":0.40999999999999992},0.40999999999999992,0.40999999999999992,"","","","","","","","",""]
[null,"drift rate 10 m",{"$f":"IF(no_applic_copy>=(COLUMN()-2),\nINDEX(act_applic_rate,COLUMN()-2)\n*VLOOKUP(INDEX(act_factor,COLUMN()-2),drift_percent_10m,IF(select_perc_type=\"MAF-crit\",13,no_applic_copy)+2,0)\n*(1-drift_reduction),\n\"\")","v":0.2},0.2,0.2,"","","","","","","","",""]
[null,"drift rate 15 m",{"$f":"IF(no_applic_copy>=(COLUMN()-2),\nINDEX(act_applic_rate,COLUMN()-2)\n*VLOOKUP(INDEX(act_factor,COLUMN()-2),drift_percent_15m,IF(select_perc_type=\"MAF-crit\",13,no_applic_copy)+2,0)\n*(1-drift_reduction),\n\"\")","v":0.14000000000000001},0.14000000000000001,0.14000000000000001,"","","","","","","","",""]
[null,"drift rate 20 m",{"$f":"IF(no_applic_copy>=(COLUMN()-2),\n(INDEX(act_applic_rate,COLUMN()-2))\n*VLOOKUP(INDEX(act_factor,COLUMN()-2),drift_percent_20m,IF(select_perc_type=\"MAF-crit\",13,no_applic_copy)+2,0)\n*(1-drift_reduction),\n\"\")","v":0.1},0.1,0.1,"","","","","","","","",""]
[null,"interval (d)",{"$f":"act_interval_applic","v":10},10,"","","","","","","","","",""]
{"$rows_left_out":72}
{"sheet":"drift_red_no","index":8,"n_rows":93,"n_cols":14,"rows_kept":93,"cut":false,"hidden":true,"merged":[]}
[]
[]
[null,"drift reduction",0]
[]
[null,"drift rate 1 m / 3 m",{"$f":"IF(no_applic_copy>=(COLUMN()-2),\nINDEX(act_applic_rate,COLUMN()-2)\n*VLOOKUP(INDEX(act_factor,COLUMN()-2),drift_percent_01m,IF(select_perc_type=\"MAF-crit\",13,no_applic_copy)+2,0)\n*(1-drift_reduction),\n\"\")","v":2.0099999999999998},2.0099999999999998,2.0099999999999998,"","","","","","","","",""]
[null,"drift rate 5 m",{"$f":"IF(no_applic_copy>=(COLUMN()-2),\nINDEX(act_applic_rate,COLUMN()-2)\n*VLOOKUP(INDEX(act_factor,COLUMN()-2),drift_percent_05m,IF(select_perc_type=\"MAF-crit\",13,no_applic_copy)+2,0)\n*(1-drift_reduction),\n\"\")","v":0.40999999999999992},0.40999999999999992,0.40999999999999992,"","","","","","","","",""]
[null,"drift rate 10 m",{"$f":"IF(no_applic_copy>=(COLUMN()-2),\nINDEX(act_applic_rate,COLUMN()-2)\n*VLOOKUP(INDEX(act_factor,COLUMN()-2),drift_percent_10m,IF(select_perc_type=\"MAF-crit\",13,no_applic_copy)+2,0)\n*(1-drift_reduction),\n\"\")","v":0.2},0.2,0.2,"","","","","","","","",""]
[null,"drift rate 15 m",{"$f":"IF(no_applic_copy>=(COLUMN()-2),\nINDEX(act_applic_rate,COLUMN()-2)\n*VLOOKUP(INDEX(act_factor,COLUMN()-2),drift_percent_15m,IF(select_perc_type=\"MAF-crit\",13,no_applic_copy)+2,0)\n*(1-drift_reduction),\n\"\")","v":0.14000000000000001},0.14000000000000001,0.14000000000000001,"","","","","","","","",""]
[null,"drift rate 20 m",{"$f":"IF(no_applic_copy>=(COLUMN()-2),\n(INDEX(act_applic_rate,COLUMN()-2))\n*VLOOKUP(INDEX(act_factor,COLUMN()-2),drift_percent_20m,IF(select_perc_type=\"MAF-crit\",13,no_applic_copy)+2,0)\n*(1-drift_reduction),\n\"\")","v":0.1},0.1,0.1,"","","","","","","","",""]
[]
{"$rows_left_out":84}
{"sheet":"drift_red_50","index":9,"n_rows":93,"n_cols":14,"rows_kept":93,"cut":false,"hidden":true,"merged":[]}
[]
[]
[null,"drift reduction",0.5]
[]
[null,"drift rate 1 m / 3 m",{"$f":"IF(no_applic_copy>=(COLUMN()-2),\nINDEX(act_applic_rate,COLUMN()-2)\n*VLOOKUP(INDEX(act_factor,COLUMN()-2),drift_percent_01m,IF(select_perc_type=\"MAF-crit\",13,no_applic_copy)+2,0)\n*(1-drift_reduction),\n\"\")","v":1.0049999999999999},1.0049999999999999,1.0049999999999999,"","","","","","","","",""]
[null,"drift rate 5 m",{"$f":"IF(no_applic_copy>=(COLUMN()-2),\nINDEX(act_applic_rate,COLUMN()-2)\n*VLOOKUP(INDEX(act_factor,COLUMN()-2),drift_percent_05m,IF(select_perc_type=\"MAF-crit\",13,no_applic_copy)+2,0)\n*(1-drift_reduction),\n\"\")","v":0.20499999999999996},0.20499999999999996,0.20499999999999996,"","","","","","","","",""]
[null,"drift rate 10 m",{"$f":"IF(no_applic_copy>=(COLUMN()-2),\nINDEX(act_applic_rate,COLUMN()-2)\n*VLOOKUP(INDEX(act_factor,COLUMN()-2),drift_percent_10m,IF(select_perc_type=\"MAF-crit\",13,no_applic_copy)+2,0)\n*(1-drift_reduction),\n\"\")","v":0.1},0.1,0.1,"","","","","","","","",""]
[null,"drift rate 15 m",{"$f":"IF(no_applic_copy>=(COLUMN()-2),\nINDEX(act_applic_rate,COLUMN()-2)\n*VLOOKUP(INDEX(act_factor,COLUMN()-2),drift_percent_15m,IF(select_perc_type=\"MAF-crit\",13,no_applic_copy)+2,0)\n*(1-drift_reduction),\n\"\")","v":7.0000000000000007E-2},7.0000000000000007E-2,7.0000000000000007E-2,"","","","","","","","",""]
[null,"drift rate 20 m",{"$f":"IF(no_applic_copy>=(COLUMN()-2),\n(INDEX(act_applic_rate,COLUMN()-2))\n*VLOOKUP(INDEX(act_factor,COLUMN()-2),drift_percent_20m,IF(select_perc_type=\"MAF-crit\",13,no_applic_copy)+2,0)\n*(1-drift_reduction),\n\"\")","v":0.05},0.05,0.05,"","","","","","","","",""]
[]
{"$rows_left_out":84}
{"sheet":"drift_red_75","index":10,"n_rows":93,"n_cols":14,"rows_kept":93,"cut":false,"hidden":true,"merged":[]}
[]
[]
[null,"drift reduction",0.75]
[]
[null,"drift rate 1 m / 3 m",{"$f":"IF(no_applic_copy>=(COLUMN()-2),\nINDEX(act_applic_rate,COLUMN()-2)\n*VLOOKUP(INDEX(act_factor,COLUMN()-2),drift_percent_01m,IF(select_perc_type=\"MAF-crit\",13,no_applic_copy)+2,0)\n*(1-drift_reduction),\n\"\")","v":0.50249999999999995},0.50249999999999995,0.50249999999999995,"","","","","","","","",""]
[null,"drift rate 5 m",{"$f":"IF(no_applic_copy>=(COLUMN()-2),\nINDEX(act_applic_rate,COLUMN()-2)\n*VLOOKUP(INDEX(act_factor,COLUMN()-2),drift_percent_05m,IF(select_perc_type=\"MAF-crit\",13,no_applic_copy)+2,0)\n*(1-drift_reduction),\n\"\")","v":0.10249999999999998},0.10249999999999998,0.10249999999999998,"","","","","","","","",""]
[null,"drift rate 10 m",{"$f":"IF(no_applic_copy>=(COLUMN()-2),\nINDEX(act_applic_rate,COLUMN()-2)\n*VLOOKUP(INDEX(act_factor,COLUMN()-2),drift_percent_10m,IF(select_perc_type=\"MAF-crit\",13,no_applic_copy)+2,0)\n*(1-drift_reduction),\n\"\")","v":0.05},0.05,0.05,"","","","","","","","",""]
[null,"drift rate 15 m",{"$f":"IF(no_applic_copy>=(COLUMN()-2),\nINDEX(act_applic_rate,COLUMN()-2)\n*VLOOKUP(INDEX(act_factor,COLUMN()-2),drift_percent_15m,IF(select_perc_type=\"MAF-crit\",13,no_applic_copy)+2,0)\n*(1-drift_reduction),\n\"\")","v":3.5000000000000003E-2},3.5000000000000003E-2,3.5000000000000003E-2,"","","","","","","","",""]
[null,"drift rate 20 m",{"$f":"IF(no_applic_copy>=(COLUMN()-2),\n(INDEX(act_applic_rate,COLUMN()-2))\n*VLOOKUP(INDEX(act_factor,COLUMN()-2),drift_percent_20m,IF(select_perc_type=\"MAF-crit\",13,no_applic_copy)+2,0)\n*(1-drift_reduction),\n\"\")","v":2.5000000000000001E-2},2.5000000000000001E-2,2.5000000000000001E-2,"","","","","","","","",""]
[]
{"$rows_left_out":84}
{"sheet":"drift_red_90","index":11,"n_rows":93,"n_cols":14,"rows_kept":93,"cut":false,"hidden":true,"merged":[]}
[]
[]
[null,"drift reduction",0.9]
[]
[null,"drift rate 1 m / 3 m",{"$f":"IF(no_applic_copy>=(COLUMN()-2),\nINDEX(act_applic_rate,COLUMN()-2)\n*VLOOKUP(INDEX(act_factor,COLUMN()-2),drift_percent_01m,IF(select_perc_type=\"MAF-crit\",13,no_applic_copy)+2,0)\n*(1-drift_reduction),\n\"\")","v":0.20099999999999993},0.20099999999999993,0.20099999999999993,"","","","","","","","",""]
[null,"drift rate 5 m",{"$f":"IF(no_applic_copy>=(COLUMN()-2),\nINDEX(act_applic_rate,COLUMN()-2)\n*VLOOKUP(INDEX(act_factor,COLUMN()-2),drift_percent_05m,IF(select_perc_type=\"MAF-crit\",13,no_applic_copy)+2,0)\n*(1-drift_reduction),\n\"\")","v":4.0999999999999981E-2},4.0999999999999981E-2,4.0999999999999981E-2,"","","","","","","","",""]
[null,"drift rate 10 m",{"$f":"IF(no_applic_copy>=(COLUMN()-2),\nINDEX(act_applic_rate,COLUMN()-2)\n*VLOOKUP(INDEX(act_factor,COLUMN()-2),drift_percent_10m,IF(select_perc_type=\"MAF-crit\",13,no_applic_copy)+2,0)\n*(1-drift_reduction),\n\"\")","v":1.9999999999999997E-2},1.9999999999999997E-2,1.9999999999999997E-2,"","","","","","","","",""]
[null,"drift rate 15 m",{"$f":"IF(no_applic_copy>=(COLUMN()-2),\nINDEX(act_applic_rate,COLUMN()-2)\n*VLOOKUP(INDEX(act_factor,COLUMN()-2),drift_percent_15m,IF(select_perc_type=\"MAF-crit\",13,no_applic_copy)+2,0)\n*(1-drift_reduction),\n\"\")","v":1.3999999999999999E-2},1.3999999999999999E-2,1.3999999999999999E-2,"","","","","","","","",""]
[null,"drift rate 20 m",{"$f":"IF(no_applic_copy>=(COLUMN()-2),\n(INDEX(act_applic_rate,COLUMN()-2))\n*VLOOKUP(INDEX(act_factor,COLUMN()-2),drift_percent_20m,IF(select_perc_type=\"MAF-crit\",13,no_applic_copy)+2,0)\n*(1-drift_reduction),\n\"\")","v":9.9999999999999985E-3},9.9999999999999985E-3,9.9999999999999985E-3,"","","","","","","","",""]
[]
{"$rows_left_out":84}
{"sheet":"drift_cum-effect","index":12,"n_rows":102,"n_cols":14,"rows_kept":102,"cut":false,"hidden":true,"merged":[]}
[]
[]
[null,null,null,null,"probit","logit"]
[null,"dose-response fitting",{"$f":"select_fitting_approach","v":"probit"},"slope",{"$f":"probit_slope","v":0.73610888633185234},{"$f":"logit_slope","v":1.1989778467157903}]
[null,null,null,"intercept",{"$f":"probit_intercept","v":-2.3694430986842536},{"$f":"logit_intercept","v":-3.8593608053459887}]
[]
[]
[null,"max. peak amount","1 m / 3 m","5 m","10 m","15 m","20 m"]
[null,{"$f":"\"drift reduction \"&TEXT(drift_red_no!drift_reduction,\"0%\")","v":"drift reduction 0%"},{"$f":"MAX(peak_amount_00p_01m)","v":1.1408482078641951},{"$f":"MAX(peak_amount_00p_05m)","v":0.19968377874866694},{"$f":"MAX(peak_amount_00p_10m)","v":9.3200009019669516E-2},{"$f":"MAX(peak_amount_00p_15m)","v":6.4052755242601095E-2},{"$f":"MAX(peak_amount_00p_20m)","v":4.5044237613654489E-2}]
[null,{"$f":"\"drift reduction \"&TEXT(drift_red_50!drift_reduction,\"0%\")","v":"drift reduction 50%"},{"$f":"MAX(peak_amount_50p_01m)","v":0.52710931573577291},{"$f":"MAX(peak_amount_50p_05m)","v":9.5659020403480816E-2},{"$f":"MAX(peak_amount_50p_10m)","v":4.5044237613654489E-2},{"$f":"MAX(peak_amount_50p_15m)","v":3.1063113201018015E-2},{"$f":"MAX(peak_amount_50p_20m)","v":2.1905415135443078E-2}]
{"$rows_left_out":93}
{"sheet":"drift_data","index":13,"n_rows":92,"n_cols":17,"rows_kept":92,"cut":false,"hidden":true,"merged":[]}
[]
[]
[]
[]
[null,null,null,null,null,null,null,null,null,null,null,null,null,null,"MAF-crit",null,{"$f":"MAF_crit","v":1.75}]
[]
[null,null,null,null,null,null,null,null,null,null,null,null,null,null,"%-ile"]
[null,null,null,null,null,null,null,null,null,null,null,null,null,null,"MAF-crit","upper bound","lower bound"]
[null,null,null,null,null,null,null,null,null,null,null,null,null,null,{"$f":"ROUND(NORMSDIST(NORMSINV(0.9)/SQRT(MAF_crit))*100,1)","v":83.4},{"$f":"INDEX({90;82;77;74;72;70;69;67},MATCH(MAF_crit_perc,{90;82;77;74;72;70;69;67},-1))","v":90},{"$f":"INDEX({67;69;70;72;74;77;82;90},MATCH(MAF_crit_perc,{67;69;70;72;74;77;82;90},1))","v":82}]
[]
{"$rows_left_out":83}
{"sheet":"vd_data","index":14,"n_rows":180,"n_cols":26,"rows_kept":180,"cut":false,"hidden":true,"merged":[[31,4,31,7],[31,8,31,11]]}
[]
[]
[]
[]
[]
[]
[]
[]
[]
[]
{"$rows_left_out":171}
{"sheet":"applic_data","index":15,"n_rows":18,"n_cols":12,"rows_kept":18,"cut":false,"hidden":true,"merged":[]}
["act_applic_rate (#1-12)"]
[{"$f":"IF(no_applic>=(COLUMN()),\nINDEX(applic_rate,MAX(((applic_rate1:INDEX(applic_rate,COLUMN()))<>\"\")*(COLUMN(applic_rate1:INDEX(applic_rate,COLUMN()))-2))),\n\"\")","v":100},100,100,"","","","","","","","",""]
[]
["act_factor (#1-12)"]
[{"$f":"IF(no_applic>=(COLUMN()),\nINDEX(factor,MAX(((factor1:INDEX(factor,COLUMN()))<>\"\")*(COLUMN(factor1:INDEX(factor,COLUMN()))-2))),\n\"\")","v":"arable crops"},"arable crops","arable crops","","","","","","","","",""]
[]
["act_interval_applic (#1-12)"]
[{"$f":"IF(no_applic>(COLUMN()),\nINDEX(interval_applic,MAX(((interval_applic1:INDEX(interval_applic,COLUMN()))<>\"\")*(COLUMN(interval_applic1:INDEX(interval_applic,COLUMN()))-2))),\n\"\")","v":10},10,"","","","","","","","","",{"$f":"\"\"","v":""}]
[]
["k_deg_copy"]
{"$rows_left_out":9}
{"sheet":"report_table_data","index":16,"n_rows":69,"n_cols":7,"rows_kept":69,"cut":false,"hidden":true,"merged":[]}
["report_table_type, report_table_content"]
["aquatic environment - water","aquatic environment - sed.","terrestrial arthropods","terrestrial plants"]
["active substance/product:","active substance/product:","active substance/product:","active substance/product:"]
["intended use:","intended use:","intended use:","intended use:"]
["application parameters:","application parameters:","application parameters:","application parameters:"]
["DisT50 water phase (SFO):","DegT50 w.-s. system (SFO):","MAF:","MAF:"]
["scenario, drift percentile:","scenario, drift percentile:","scenario, drift percentile:","scenario, drift percentile:"]
["PEC type:","PEC type:","vdf (2D/3D correction)","interception (off-crop)"]
[]
["select_exp","select_vdf","select_int"]
{"$rows_left_out":60}
{"sheet":"revision_table","index":17,"n_rows":59,"n_cols":3,"rows_kept":59,"cut":false,"hidden":true,"merged":[]}
["version","issue","affected worksheets and/or cell ranges"]
["rev1i","PEC and TER values considering drift-reducing nozzles are no longer displayed for drift scenarios knapsack sprayer, gardening, and greenhouse","main!I33:K37\nnull string if respective scenarios are selected"]
[null,"correction factor for considering actual interception in wind tunnel studies","vd!C40:C41\nformula considering different volatilisation amounts from plant and soil"]
[null,null,"vd!E47:F51\ncorrection factor included in calculation"]
[null,"error correction in determining the relevant application rate for v/d calculation","vd!C16\nformula re-entered as matrix formula (similar to C15)"]
["rev2a-development","inclusion of new concept for drift percentiles accounting for residue dynamics in the target compartment","drift_data!O5:Q92\ncalculation of sequence drift percentiles according to formula:\nperci = Φ (Φ-1 (0.9) / √MAF-crit)\nwith interpolation of corresponding drift values between tabulated basic drift values"]
[null,null,"new worksheet MAF_crit_applic\ncalculation of a MAF-crit that is normalised to the highest single rate in the application sequence"]
[null,null,"main!E7:F7\nselection of drift percentile type"]
[null,null,"main!C28\nconsideration in output for report"]
[null,null,"drift_only!C5:N9; drift_red_no!C5:N9; drift_red_50!C5:N9; drift_red_75!C5:N9; drift_red_90!C5:N9\nselection for drift percentile values extended"]
{"$rows_left_out":50}
{"sheet":"list_names","index":18,"n_rows":533,"n_cols":12,"rows_kept":533,"cut":false,"hidden":true,"merged":[]}
["Name","RefersToLocal","Visible","Local name","Error","External link","Relative","3-D","Areas","Cells","UnUsed","RefersToRange"]
["compartment","=main!$B$14",true,false,false,false,false,false,1,1,"Not checked","[EVA3_rev2h.xlsm]main!$B$14"]
["mult_applic","=main!$B$17",true,false,false,false,false,false,1,1,"Not checked","[EVA3_rev2h.xlsm]main!$B$17"]
["main!dt50_type","=main!$B$20",true,true,false,false,false,false,1,1,"Not checked","[EVA3_rev2h.xlsm]main!$B$20"]
["main!select_parameter","=main!$B$23",true,true,false,false,false,false,1,1,"Not checked","[EVA3_rev2h.xlsm]main!$B$23"]
["parameter","=main!$B$24",true,false,false,false,false,false,1,1,"Not checked","[EVA3_rev2h.xlsm]main!$B$24"]
["main!vd_rate_select","=main!$B$51",true,true,false,false,false,false,1,1,"Not checked","[EVA3_rev2h.xlsm]main!$B$51"]
["factor1","=main!$C$10",true,false,false,false,false,false,1,1,"Not checked","[EVA3_rev2h.xlsm]main!$C$10"]
["factor","=main!$C$10:$N$10",true,false,false,false,false,false,1,12,"Not checked","[EVA3_rev2h.xlsm]main!$C$10:$N$10"]
["interval_applic1","=main!$C$11",true,false,false,false,false,false,1,1,"Not checked","[EVA3_rev2h.xlsm]main!$C$11"]
{"$rows_left_out":523}